last 20 errors ----------------------------------------
configure: error: required library 'flite_cmu_us_kal16' not found -- quitting
rsync error: syntax or usage error (code 1) at main.c(1236) [Receiver=3.0.7]
last 15 lines ----------------------------------------
chmod -R go-w /home/pd/auto-build/pd-extended/packages/linux_make/build/
chmod -R a+r /home/pd/auto-build/pd-extended/packages/linux_make/build/
find /home/pd/auto-build/pd-extended/packages/linux_make/build/ -name \*.pd_linux | xargs chmod a-x
find /home/pd/auto-build/pd-extended/packages/linux_make/build/ -name \*.pd | xargs chmod a-x
find /home/pd/auto-build/pd-extended/packages/linux_make/build/ -type d | xargs chmod a+x
fakeroot dpkg-deb --build /home/pd/auto-build/pd-extended/packages/linux_make/build/ /home/pd/auto-build/pd-extended/packages/linux_make/Pd-0.43.1-extended-20110615.deb
dpkg-deb: parse error, in file '/home/pd/auto-build/pd-extended/packages/linux_make/build//DEBIAN/control' near line 7:
missing package name
make: *** [deb] Error 2
ls: cannot access /home/pd/auto-build/pd-extended/packages/linux_make/./Pd*.deb: No such file or directory
upload specs linux_make . deb
Uploading
Unexpected local arg: README
If arg is a remote file/dir, prefix it with a colon (:).
rsync error: syntax or usage error (code 1) at main.c(1236) [Receiver=3.0.7]
the full logfile - if it has been succesfully uploaded - can be viewed at:
http://autobuild.puredata.info/auto-build/2011-06-15/logs/2011-06-15_02.35.…
last 20 errors ----------------------------------------
id: cannot find name for user ID 1001
id: cannot find name for user ID 1001
id: cannot find name for user ID 1001
id: cannot find name for user ID 1001
id: cannot find name for user ID 1001
id: cannot find name for user ID 1001
id: cannot find name for user ID 1001
id: cannot find name for user ID 1001
id: cannot find name for user ID 1001
id: cannot find name for user ID 1001
id: cannot find name for user ID 1001
id: cannot find name for user ID 1001
id: cannot find name for user ID 1001
id: cannot find name for user ID 1001
id: cannot find name for user ID 1001
id: cannot find name for user ID 1001
id: cannot find name for user ID 1001
configure: error: required library 'flite_cmu_us_kal16' not found -- quitting
gcc: error: unrecognized option '---export-dynamic'
rsync error: syntax or usage error (code 1) at main.c(1246) [Receiver=3.0.8]
last 15 lines ----------------------------------------
gcc ---export-dynamic -shared -o pdp.pd_linux modules/*/*.o system/pdp.o system/*/*.o puredata/*.o -lgslcblas -lm -lgslcblas -lgsl -lz -lpng -L/usr/X11R6/lib -lX11 -lXv -lXext -lquicktime -lGL -lGLU -lSDL
gcc: error: unrecognized option '---export-dynamic'
make[3]: *** [linux_mmx] Error 1
make[3]: Leaving directory `/home/pd/auto-build/pd-extended/externals/pdp'
make[2]: *** [/home/pd/auto-build/pd-extended/externals/pdp/pdp.pd_linux] Error 2
make[2]: Leaving directory `/home/pd/auto-build/pd-extended/externals'
make[1]: *** [externals_install] Error 2
make[1]: Leaving directory `/home/pd/auto-build/pd-extended/packages'
make: *** [install] Error 2
ls: cannot access /home/pd/auto-build/pd-extended/packages/linux_make/./Pd*.deb: No such file or directory
upload specs linux_make . deb
Uploading
Unexpected local arg: README
If arg is a remote file/dir, prefix it with a colon (:).
rsync error: syntax or usage error (code 1) at main.c(1246) [Receiver=3.0.8]
the full logfile - if it has been succesfully uploaded - can be viewed at:
http://autobuild.puredata.info/auto-build/2011-06-15/logs/2011-06-15_02.35.…
last 20 errors ----------------------------------------
rsync error: syntax or usage error (code 1) at main.c(1236) [Receiver=3.0.7]
last 15 lines ----------------------------------------
chmod -R go-w /home/pd/auto-build/pd-extended/packages/linux_make/build/
chmod -R a+r /home/pd/auto-build/pd-extended/packages/linux_make/build/
find /home/pd/auto-build/pd-extended/packages/linux_make/build/ -name \*.pd_linux | xargs chmod a-x
find /home/pd/auto-build/pd-extended/packages/linux_make/build/ -name \*.pd | xargs chmod a-x
find /home/pd/auto-build/pd-extended/packages/linux_make/build/ -type d | xargs chmod a+x
fakeroot dpkg-deb --build /home/pd/auto-build/pd-extended/packages/linux_make/build/ /home/pd/auto-build/pd-extended/packages/linux_make/Pd-0.43.1-extended-20110615.deb
dpkg-deb: parse error, in file `/home/pd/auto-build/pd-extended/packages/linux_make/build//DEBIAN/control' near line 8:
missing package name
make: *** [deb] Error 2
ls: cannot access /home/pd/auto-build/pd-extended/packages/linux_make/./Pd*.deb: No such file or directory
upload specs linux_make . deb
Uploading
Unexpected local arg: debian
If arg is a remote file/dir, prefix it with a colon (:).
rsync error: syntax or usage error (code 1) at main.c(1236) [Receiver=3.0.7]
the full logfile - if it has been succesfully uploaded - can be viewed at:
http://autobuild.puredata.info/auto-build/2011-06-15/logs/2011-06-15_02.35.…
last 20 errors ----------------------------------------
rsync error: syntax or usage error (code 1) at main.c(1236) [Receiver=3.0.7]
last 15 lines ----------------------------------------
configure.ac:7: installing `./missing'
Base/Makefile.am: installing `./depcomp'
configure.ac:45: required file `extra/pix_drum/Makefile.in' not found
autoreconf: automake failed with exit status: 1
make[2]: *** [/home/pd/auto-build/pd-extended/externals/Gem/src/configure] Error 1
make[2]: Leaving directory `/home/pd/auto-build/pd-extended/externals'
make[1]: *** [externals_install] Error 2
make[1]: Leaving directory `/home/pd/auto-build/pd-extended/packages'
make: *** [install] Error 2
ls: cannot access /home/pd/auto-build/pd-extended/packages/linux_make/./Pd*.deb: No such file or directory
upload specs linux_make . deb
Uploading
Unexpected local arg: debian
If arg is a remote file/dir, prefix it with a colon (:).
rsync error: syntax or usage error (code 1) at main.c(1236) [Receiver=3.0.7]
the full logfile - if it has been succesfully uploaded - can be viewed at:
http://autobuild.puredata.info/auto-build/2011-06-14/logs/2011-06-14_07.59.…
ERROR: module is write only
rsync error: syntax or usage error (code 1) at main.c(711) [sender=3.0.7]
rsync error: error in rsync protocol data stream (code 12) at /home/lapo/packaging/rsync-3.0.4-1/src/rsync-3.0.4/io.c(632) [receiver=3.0.4]
the full logfile can be viewed at
http://autobuild.puredata.info/auto-build/2011-06-14/logs/
last 20 errors ----------------------------------------
rsync error: syntax or usage error (code 1) at main.c(1236) [Receiver=3.0.7]
last 15 lines ----------------------------------------
configure.ac:7: installing `./missing'
Base/Makefile.am: installing `./depcomp'
configure.ac:45: required file `extra/pix_drum/Makefile.in' not found
autoreconf: automake failed with exit status: 1
make[2]: *** [/home/pd/auto-build/pd-extended/externals/Gem/src/configure] Error 1
make[2]: Leaving directory `/home/pd/auto-build/pd-extended/externals'
make[1]: *** [externals_install] Error 2
make[1]: Leaving directory `/home/pd/auto-build/pd-extended/packages'
make: *** [install] Error 2
ls: cannot access /home/pd/auto-build/pd-extended/packages/linux_make/./Pd*.deb: No such file or directory
upload specs linux_make . deb
Uploading
Unexpected local arg: debian
If arg is a remote file/dir, prefix it with a colon (:).
rsync error: syntax or usage error (code 1) at main.c(1236) [Receiver=3.0.7]
the full logfile - if it has been succesfully uploaded - can be viewed at:
http://autobuild.puredata.info/auto-build/2011-06-14/logs/2011-06-14_06.51.…
last 20 errors ----------------------------------------
rsync error: syntax or usage error (code 1) at main.c(1236) [Receiver=3.0.7]
last 15 lines ----------------------------------------
configure.ac:7: installing `./missing'
Base/Makefile.am: installing `./depcomp'
configure.ac:45: required file `extra/pix_drum/Makefile.in' not found
autoreconf: automake failed with exit status: 1
make[2]: *** [/home/pd/auto-build/pd-extended/externals/Gem/src/configure] Error 1
make[2]: Leaving directory `/home/pd/auto-build/pd-extended/externals'
make[1]: *** [externals_install] Error 2
make[1]: Leaving directory `/home/pd/auto-build/pd-extended/packages'
make: *** [install] Error 2
ls: cannot access /home/pd/auto-build/pd-extended/packages/linux_make/./Pd*.deb: No such file or directory
upload specs linux_make . deb
Uploading
Unexpected local arg: debian
If arg is a remote file/dir, prefix it with a colon (:).
rsync error: syntax or usage error (code 1) at main.c(1236) [Receiver=3.0.7]
the full logfile - if it has been succesfully uploaded - can be viewed at:
http://autobuild.puredata.info/auto-build/2011-06-14/logs/2011-06-14_06.51.…
last 20 errors ----------------------------------------
ERROR: module is write only
rsync error: syntax or usage error (code 1) at main.c(711) [sender=3.0.7]
rsync error: error in rsync protocol data stream (code 12) at /home/lapo/packaging/rsync-3.0.4-1/src/rsync-3.0.4/io.c(632) [receiver=3.0.4]
The system cannot find the path specified.
The system cannot find the path specified.
The system cannot find the path specified.
last 15 lines ----------------------------------------
/pd-settings.reg: line 4: flags=: command not found
/pd-settings.reg: line 5: loadlib1=vanilla/list: No such file or directory
/pd-settings.reg: line 6: loadlib2=vanilla: command not found
/pd-settings.reg: line 7: loadlib3=extra: command not found
/pd-settings.reg: line 8: loadlib4=Gem: command not found
/pd-settings.reg: line 9: loadlib5=cyclone: command not found
/pd-settings.reg: line 10: loadlib6=zexy: command not found
/pd-settings.reg: line 11: nloadlib=6: command not found
/pd-settings.reg: line 12: syntax error near unexpected token `;'
/pd-settings.reg: line 12: `; delete any previous loadlib flags'
C:\msys\1.0\home\pd\auto-build\pd-extended\packages\win32_inno>"bin\pd.exe" -font 10 -path "doc\vasp" -lib cyclone -lib Gem -lib OSC -lib vasp -lib xeq -lib xsample -listdev
The system cannot find the path specified.
/pd.ico: ./pd.ico: cannot execute binary file
/pdpatch.ico: ./pdpatch.ico: cannot execute binary file
the full logfile - if it has been succesfully uploaded - can be viewed at:
http://autobuild.puredata.info/auto-build/2011-06-14/logs/2011-06-14_03.31.…