/home/pd/auto-build/pd-extended/externals/build/src/../../cxc/randomix.c:460: note: vectorized 0 loops in function. /home/pd/auto-build/pd-extended/externals/build/src/../../cxc/randomix.c: In function ‘random_fl_new’: /home/pd/auto-build/pd-extended/externals/build/src/../../cxc/randomix.c:310: internal compiler error: Illegal instruction Please submit a full bug report, with preprocessed source if appropriate. See URL:http://gcc.gnu.org/bugs.html for instructions. For Debian GNU/Linux specific bug reporting instructions, see URL:file:///usr/share/doc/gcc-4.1/README.Bugs. {standard input}: Assembler messages: {standard input}:3564: Error: can't resolve `.got2' {.got2 section} - `.LCF37' {*UND* section} {standard input}:3564: Error: expression too complex The bug is not reproducible, so it is likely a hardware or OS problem. make[2]: *** [/home/pd/auto-build/pd-extended/externals/build/src/random1.o] Error 1 make[2]: Leaving directory `/home/pd/auto-build/pd-extended/externals' make[1]: *** [externals_install] Error 2 make[1]: Leaving directory `/home/pd/auto-build/pd-extended/packages' make: *** [install] Error 2 upload specs linux_make build tar.bz2 Uploading /home/pd/auto-build/pd-extended/packages/linux_make/build/Pd*.tar.bz2 ls: /home/pd/auto-build/pd-extended/packages/linux_make/build/Pd*.tar.bz2: No such file or directory