last 20 errors ----------------------------------------
collect2: error: ld returned 1 exit status
rsync error: syntax or usage error (code 1) at main.c(1246) [Receiver=3.0.9]
last 15 lines ----------------------------------------
default.pdextended
generate_install_makefile.bash
Makefile
pd-extended.desktop
pd-extended.menu
pd-extended.png
pd-extended.xml
pd-extended.xpm
README
text-x-puredata.png'
+ '[' -e ']'
+ rsync -a --chmod=a+r -e ssh apt@puredata.info:/home/apt/www/auto-build/2015-05-08/48x48 build debian default.pdextended generate_install_makefile.bash Makefile pd-extended.desktop pd-extended.menu pd-extended.png pd-extended.xml pd-extended.xpm README text-x-puredata.png
Unexpected local arg: build
If arg is a remote file/dir, prefix it with a colon (:).
rsync error: syntax or usage error (code 1) at main.c(1246) [Receiver=3.0.9]
the full logfile - if it has been succesfully uploaded - can be viewed at:
http://autobuild.puredata.info/auto-build/2015-05-08/logs/2015-05-08_06.53.…
last 20 errors ----------------------------------------
collect2: error: ld returned 1 exit status
rsync error: syntax or usage error (code 1) at main.c(1362) [Receiver=3.1.1]
last 15 lines ----------------------------------------
default.pdextended
generate_install_makefile.bash
Makefile
pd-extended.desktop
pd-extended.menu
pd-extended.png
pd-extended.xml
pd-extended.xpm
README
text-x-puredata.png
+ [ -e ]
+ rsync -a --chmod=a+r -e ssh apt@puredata.info:/home/apt/www/auto-build/2015-05-08/48x48 build debian default.pdextended generate_install_makefile.bash Makefile pd-extended.desktop pd-extended.menu pd-extended.png pd-extended.xml pd-extended.xpm README text-x-puredata.png
Unexpected local arg: build
If arg is a remote file/dir, prefix it with a colon (:).
rsync error: syntax or usage error (code 1) at main.c(1362) [Receiver=3.1.1]
the full logfile - if it has been succesfully uploaded - can be viewed at:
http://autobuild.puredata.info/auto-build/2015-05-08/logs/2015-05-08_06.53.…
last 20 errors ----------------------------------------
last 15 lines ----------------------------------------
----------------------------------------
Building in dchroot squeeze
----------------------------------------
W: line 19 [squeeze]: Deprecated key ‘script-config’ used
I: This option will be removed in the future; please update your configuration
W: line 16 [squeeze]: Obsolete key ‘priority’ used
I: This option has been removed, and no longer has any effect
E: /etc/schroot/chroot.d/conv-FeqtAt-dchroot: line 7 [squeeze]: A chroot or alias ‘chroot:squeeze’ already exists with this name
I: Duplicate names are not allowed
the full logfile - if it has been succesfully uploaded - can be viewed at:
http://autobuild.puredata.info/auto-build/2015-05-07/logs/2015-05-07_06.31.…
last 20 errors ----------------------------------------
collect2: error: ld returned 1 exit status
rsync error: syntax or usage error (code 1) at main.c(1246) [Receiver=3.0.9]
last 15 lines ----------------------------------------
default.pdextended
generate_install_makefile.bash
Makefile
pd-extended.desktop
pd-extended.menu
pd-extended.png
pd-extended.xml
pd-extended.xpm
README
text-x-puredata.png'
+ '[' -e ']'
+ rsync -a --chmod=a+r -e ssh apt@puredata.info:/home/apt/www/auto-build/2015-05-07/48x48 build debian default.pdextended generate_install_makefile.bash Makefile pd-extended.desktop pd-extended.menu pd-extended.png pd-extended.xml pd-extended.xpm README text-x-puredata.png
Unexpected local arg: build
If arg is a remote file/dir, prefix it with a colon (:).
rsync error: syntax or usage error (code 1) at main.c(1246) [Receiver=3.0.9]
the full logfile - if it has been succesfully uploaded - can be viewed at:
http://autobuild.puredata.info/auto-build/2015-05-07/logs/2015-05-07_06.47.…
last 20 errors ----------------------------------------
collect2: error: ld returned 1 exit status
rsync error: syntax or usage error (code 1) at main.c(1362) [Receiver=3.1.1]
last 15 lines ----------------------------------------
default.pdextended
generate_install_makefile.bash
Makefile
pd-extended.desktop
pd-extended.menu
pd-extended.png
pd-extended.xml
pd-extended.xpm
README
text-x-puredata.png
+ [ -e ]
+ rsync -a --chmod=a+r -e ssh apt@puredata.info:/home/apt/www/auto-build/2015-05-07/48x48 build debian default.pdextended generate_install_makefile.bash Makefile pd-extended.desktop pd-extended.menu pd-extended.png pd-extended.xml pd-extended.xpm README text-x-puredata.png
Unexpected local arg: build
If arg is a remote file/dir, prefix it with a colon (:).
rsync error: syntax or usage error (code 1) at main.c(1362) [Receiver=3.1.1]
the full logfile - if it has been succesfully uploaded - can be viewed at:
http://autobuild.puredata.info/auto-build/2015-05-07/logs/2015-05-07_06.47.…
last 20 errors ----------------------------------------
last 15 lines ----------------------------------------
----------------------------------------
Building in dchroot squeeze
----------------------------------------
W: line 19 [squeeze]: Deprecated key ‘script-config’ used
I: This option will be removed in the future; please update your configuration
W: line 16 [squeeze]: Obsolete key ‘priority’ used
I: This option has been removed, and no longer has any effect
E: /etc/schroot/chroot.d/conv-FeqtAt-dchroot: line 7 [squeeze]: A chroot or alias ‘chroot:squeeze’ already exists with this name
I: Duplicate names are not allowed
the full logfile - if it has been succesfully uploaded - can be viewed at:
http://autobuild.puredata.info/auto-build/2015-05-06/logs/2015-05-06_06.52.…
last 20 errors ----------------------------------------
collect2: error: ld returned 1 exit status
rsync error: syntax or usage error (code 1) at main.c(1246) [Receiver=3.0.9]
last 15 lines ----------------------------------------
default.pdextended
generate_install_makefile.bash
Makefile
pd-extended.desktop
pd-extended.menu
pd-extended.png
pd-extended.xml
pd-extended.xpm
README
text-x-puredata.png'
+ '[' -e ']'
+ rsync -a --chmod=a+r -e ssh apt@puredata.info:/home/apt/www/auto-build/2015-05-06/48x48 build debian default.pdextended generate_install_makefile.bash Makefile pd-extended.desktop pd-extended.menu pd-extended.png pd-extended.xml pd-extended.xpm README text-x-puredata.png
Unexpected local arg: build
If arg is a remote file/dir, prefix it with a colon (:).
rsync error: syntax or usage error (code 1) at main.c(1246) [Receiver=3.0.9]
the full logfile - if it has been succesfully uploaded - can be viewed at:
http://autobuild.puredata.info/auto-build/2015-05-06/logs/2015-05-06_06.45.…
last 20 errors ----------------------------------------
collect2: error: ld returned 1 exit status
rsync error: syntax or usage error (code 1) at main.c(1362) [Receiver=3.1.1]
last 15 lines ----------------------------------------
default.pdextended
generate_install_makefile.bash
Makefile
pd-extended.desktop
pd-extended.menu
pd-extended.png
pd-extended.xml
pd-extended.xpm
README
text-x-puredata.png
+ [ -e ]
+ rsync -a --chmod=a+r -e ssh apt@puredata.info:/home/apt/www/auto-build/2015-05-06/48x48 build debian default.pdextended generate_install_makefile.bash Makefile pd-extended.desktop pd-extended.menu pd-extended.png pd-extended.xml pd-extended.xpm README text-x-puredata.png
Unexpected local arg: build
If arg is a remote file/dir, prefix it with a colon (:).
rsync error: syntax or usage error (code 1) at main.c(1362) [Receiver=3.1.1]
the full logfile - if it has been succesfully uploaded - can be viewed at:
http://autobuild.puredata.info/auto-build/2015-05-06/logs/2015-05-06_06.45.…
This is an automated email from the git hooks/post-receive script. It was
generated because a ref change was pushed to the repository containing
the project "pure-data".
The branch, master has been updated
via 000b76119254b84b32af35438793260774f3e953 (commit)
from a97a872f7493eaf8faab8040c90ebd85e7839b4b (commit)
Those revisions listed above that are new to this repository have
not appeared on any other notification email; so we list those
revisions in full, below.
- Log -----------------------------------------------------------------
commit 000b76119254b84b32af35438793260774f3e953
Author: IOhannes m zmoelnig <zmoelnig(a)umlautQ.umlaeute.mur.at>
Date: Tue May 5 16:50:14 2015 +0200
Less restrictive definition of t_gotfn on arm64
As reported by Debian bug [783824], the restrictive definition of t_gotfn mainly
makes sense on iOS, but not on Linux (where different calling conventions are
used).
As the restrictive definition needlessly breaks builds on linux/arm64, this
patch applies to restrictive definition only on OSX/arm64 (rather than
any/arm64).
[783824] https://bugs.debian.org/cgi-bin/bugreport.cgi?bug=783824
-----------------------------------------------------------------------
Summary of changes:
src/m_pd.h | 4 ++--
1 files changed, 2 insertions(+), 2 deletions(-)
hooks/post-receive
--
pure-data
This is an automated email from the git hooks/post-receive script. It was
generated because a ref change was pushed to the repository containing
the project "pure-data".
The branch, 0.46 has been updated
via 1a9e822ddcef8da5dd4f09d867cbbd6f9c1e1ce9 (commit)
from 16dc86dacc6c78fbbfc3c1321417e1f1a0b46a0f (commit)
Those revisions listed above that are new to this repository have
not appeared on any other notification email; so we list those
revisions in full, below.
- Log -----------------------------------------------------------------
commit 1a9e822ddcef8da5dd4f09d867cbbd6f9c1e1ce9
Author: IOhannes m zmoelnig <zmoelnig(a)umlautQ.umlaeute.mur.at>
Date: Tue May 5 16:50:14 2015 +0200
Less restrictive definition of t_gotfn on arm64
As reported by Debian bug [783824], the restrictive definition of t_gotfn mainly
makes sense on iOS, but not on Linux (where different calling conventions are
used).
As the restrictive definition needlessly breaks builds on linux/arm64, this
patch applies to restrictive definition only on OSX/arm64 (rather than
any/arm64).
[783824] https://bugs.debian.org/cgi-bin/bugreport.cgi?bug=783824
-----------------------------------------------------------------------
Summary of changes:
src/m_pd.h | 4 ++--
1 files changed, 2 insertions(+), 2 deletions(-)
hooks/post-receive
--
pure-data