last 20 errors ----------------------------------------
recordV4L2.cpp:81:5: error: '::close' has not been declared
recordV4L2.cpp:159:3: error: '::write' has not been declared
recordV4L2.cpp:184:3: error: '::write' has not been declared
rsync error: syntax or usage error (code 1) at main.c(1246) [Receiver=3.0.9]
last 15 lines ----------------------------------------
make[4]: *** [all-recursive] Error 1
make[4]: Leaving directory `/home/pd/auto-build/pd-extended/externals/Gem/plugins'
make[3]: *…
[View More]** [all-recursive] Error 1
make[3]: Leaving directory `/home/pd/auto-build/pd-extended/externals/Gem'
make[2]: *** [/home/pd/auto-build/pd-extended/externals/Gem/Gem.pd_linux] Error 2
make[2]: Leaving directory `/home/pd/auto-build/pd-extended/externals'
make[1]: *** [externals_install] Error 2
make[1]: Leaving directory `/home/pd/auto-build/pd-extended/packages'
make: *** [install] Error 2
ls: cannot access /home/pd/auto-build/pd-extended/packages/linux_make/./Pd*.deb: No such file or directory
upload specs linux_make . deb
Uploading
Unexpected local arg: README
If arg is a remote file/dir, prefix it with a colon (:).
rsync error: syntax or usage error (code 1) at main.c(1246) [Receiver=3.0.9]
the full logfile - if it has been succesfully uploaded - can be viewed at:
http://autobuild.puredata.info/auto-build/2012-09-20/logs/2012-09-20_06.29.…
[View Less]
last 20 errors ----------------------------------------
rsync error: syntax or usage error (code 1) at main.c(1236) [Receiver=3.0.7]
last 15 lines ----------------------------------------
/home/pd/auto-build/pd-extended/packages/linux_make/build//usr/lib/pd-extended/extra/ekext
install: cannot stat `ninjacount-help.pd': No such file or directory
make[3]: *** [install-doc] Error 1
make[3]: Leaving directory `/home/pd/auto-build/pd-extended/externals/ekext'
make[2]: *** [ekext_install] Error 2
…
[View More]make[2]: Leaving directory `/home/pd/auto-build/pd-extended/externals'
make[1]: *** [externals_install] Error 2
make[1]: Leaving directory `/home/pd/auto-build/pd-extended/packages'
make: *** [install] Error 2
ls: cannot access /home/pd/auto-build/pd-extended/packages/linux_make/./Pd*.deb: No such file or directory
upload specs linux_make . deb
Uploading
Unexpected local arg: debian
If arg is a remote file/dir, prefix it with a colon (:).
rsync error: syntax or usage error (code 1) at main.c(1236) [Receiver=3.0.7]
the full logfile - if it has been succesfully uploaded - can be viewed at:
http://autobuild.puredata.info/auto-build/2012-09-20/logs/2012-09-20_06.26.…
[View Less]
last 20 errors ----------------------------------------
recordV4L2.cpp:81:5: error: '::close' has not been declared
recordV4L2.cpp:159:3: error: '::write' has not been declared
recordV4L2.cpp:184:3: error: '::write' has not been declared
rsync error: syntax or usage error (code 1) at main.c(1246) [Receiver=3.0.9]
last 15 lines ----------------------------------------
make[4]: *** [all-recursive] Error 1
make[4]: Leaving directory `/home/pd/auto-build/pd-extended/externals/Gem/plugins'
make[3]: *…
[View More]** [all-recursive] Error 1
make[3]: Leaving directory `/home/pd/auto-build/pd-extended/externals/Gem'
make[2]: *** [/home/pd/auto-build/pd-extended/externals/Gem/Gem.pd_linux] Error 2
make[2]: Leaving directory `/home/pd/auto-build/pd-extended/externals'
make[1]: *** [externals_install] Error 2
make[1]: Leaving directory `/home/pd/auto-build/pd-extended/packages'
make: *** [install] Error 2
ls: cannot access /home/pd/auto-build/pd-extended/packages/linux_make/./Pd*.deb: No such file or directory
upload specs linux_make . deb
Uploading
Unexpected local arg: README
If arg is a remote file/dir, prefix it with a colon (:).
rsync error: syntax or usage error (code 1) at main.c(1246) [Receiver=3.0.9]
the full logfile - if it has been succesfully uploaded - can be viewed at:
http://autobuild.puredata.info/auto-build/2012-09-19/logs/2012-09-19_06.28.…
[View Less]
last 20 errors ----------------------------------------
rsync error: syntax or usage error (code 1) at main.c(1236) [Receiver=3.0.7]
last 15 lines ----------------------------------------
/home/pd/auto-build/pd-extended/packages/linux_make/build//usr/lib/pd-extended/extra/ekext
install: cannot stat `ninjacount-help.pd': No such file or directory
make[3]: *** [install-doc] Error 1
make[3]: Leaving directory `/home/pd/auto-build/pd-extended/externals/ekext'
make[2]: *** [ekext_install] Error 2
…
[View More]make[2]: Leaving directory `/home/pd/auto-build/pd-extended/externals'
make[1]: *** [externals_install] Error 2
make[1]: Leaving directory `/home/pd/auto-build/pd-extended/packages'
make: *** [install] Error 2
ls: cannot access /home/pd/auto-build/pd-extended/packages/linux_make/./Pd*.deb: No such file or directory
upload specs linux_make . deb
Uploading
Unexpected local arg: debian
If arg is a remote file/dir, prefix it with a colon (:).
rsync error: syntax or usage error (code 1) at main.c(1236) [Receiver=3.0.7]
the full logfile - if it has been succesfully uploaded - can be viewed at:
http://autobuild.puredata.info/auto-build/2012-09-19/logs/2012-09-19_06.25.…
[View Less]
last 20 errors ----------------------------------------
recordV4L2.cpp:81:5: error: '::close' has not been declared
recordV4L2.cpp:159:3: error: '::write' has not been declared
recordV4L2.cpp:184:3: error: '::write' has not been declared
rsync error: syntax or usage error (code 1) at main.c(1246) [Receiver=3.0.9]
last 15 lines ----------------------------------------
make[4]: *** [all-recursive] Error 1
make[4]: Leaving directory `/home/pd/auto-build/pd-extended/externals/Gem/plugins'
make[3]: *…
[View More]** [all-recursive] Error 1
make[3]: Leaving directory `/home/pd/auto-build/pd-extended/externals/Gem'
make[2]: *** [/home/pd/auto-build/pd-extended/externals/Gem/Gem.pd_linux] Error 2
make[2]: Leaving directory `/home/pd/auto-build/pd-extended/externals'
make[1]: *** [externals_install] Error 2
make[1]: Leaving directory `/home/pd/auto-build/pd-extended/packages'
make: *** [install] Error 2
ls: cannot access /home/pd/auto-build/pd-extended/packages/linux_make/./Pd*.deb: No such file or directory
upload specs linux_make . deb
Uploading
Unexpected local arg: README
If arg is a remote file/dir, prefix it with a colon (:).
rsync error: syntax or usage error (code 1) at main.c(1246) [Receiver=3.0.9]
the full logfile - if it has been succesfully uploaded - can be viewed at:
http://autobuild.puredata.info/auto-build/2012-09-18/logs/2012-09-18_06.28.…
[View Less]
last 20 errors ----------------------------------------
rsync error: syntax or usage error (code 1) at main.c(1236) [Receiver=3.0.7]
last 15 lines ----------------------------------------
/home/pd/auto-build/pd-extended/packages/linux_make/build//usr/lib/pd-extended/extra/ekext
install: cannot stat `ninjacount-help.pd': No such file or directory
make[3]: *** [install-doc] Error 1
make[3]: Leaving directory `/home/pd/auto-build/pd-extended/externals/ekext'
make[2]: *** [ekext_install] Error 2
…
[View More]make[2]: Leaving directory `/home/pd/auto-build/pd-extended/externals'
make[1]: *** [externals_install] Error 2
make[1]: Leaving directory `/home/pd/auto-build/pd-extended/packages'
make: *** [install] Error 2
ls: cannot access /home/pd/auto-build/pd-extended/packages/linux_make/./Pd*.deb: No such file or directory
upload specs linux_make . deb
Uploading
Unexpected local arg: debian
If arg is a remote file/dir, prefix it with a colon (:).
rsync error: syntax or usage error (code 1) at main.c(1236) [Receiver=3.0.7]
the full logfile - if it has been succesfully uploaded - can be viewed at:
http://autobuild.puredata.info/auto-build/2012-09-18/logs/2012-09-18_06.25.…
[View Less]
This is an automated email from the git hooks/post-receive script. It was
generated because a ref change was pushed to the repository containing
the project "pure-data".
The branch, master has been updated
via 3e51f13d38fcc3c9aec0edbde37ceb716a84f2f8 (commit)
via d3426acfa6cb7de3f3ed26764264fb43ec6cef4b (commit)
from 1403f78a100ed7d3d5bf5a4ee2ab427890ee392f (commit)
Those revisions listed above that are new to this repository have
not appeared on any other notification …
[View More]email; so we list those
revisions in full, below.
- Log -----------------------------------------------------------------
commit 3e51f13d38fcc3c9aec0edbde37ceb716a84f2f8
Author: Miller Puckette <msp(a)ucsd.edu>
Date: Mon Sep 17 17:41:42 2012 -0700
Improved "OSS" midi handling on linux and took out spurious
";" escaping in post() and friends.
commit d3426acfa6cb7de3f3ed26764264fb43ec6cef4b
Author: Miller Puckette <msp(a)ucsd.edu>
Date: Mon Sep 17 16:23:34 2012 -0700
update README to suggest using autoconf before ./configure if none
was in your source distro
-----------------------------------------------------------------------
Summary of changes:
README.txt | 16 +++--
src/s_midi.c | 16 +++--
src/s_midi_oss.c | 187 ++++++++++++++++++++----------------------------------
src/s_print.c | 2 +-
4 files changed, 91 insertions(+), 130 deletions(-)
hooks/post-receive
--
pure-data
[View Less]
Revision: 16253
http://pure-data.svn.sourceforge.net/pure-data/?rev=16253&view=rev
Author: eighthave
Date: 2012-09-17 18:30:46 +0000 (Mon, 17 Sep 2012)
Log Message:
-----------
add puredata-core to pd dep so there is a real package tried before the virtual
Modified Paths:
--------------
trunk/externals/postlude/psql/debian/control
This was sent by the SourceForge.net collaborative development platform, the world's largest Open Source development site.
last 20 errors ----------------------------------------
recordV4L2.cpp:81:5: error: '::close' has not been declared
recordV4L2.cpp:159:3: error: '::write' has not been declared
recordV4L2.cpp:184:3: error: '::write' has not been declared
rsync error: syntax or usage error (code 1) at main.c(1246) [Receiver=3.0.9]
last 15 lines ----------------------------------------
make[4]: *** [all-recursive] Error 1
make[4]: Leaving directory `/home/pd/auto-build/pd-extended/externals/Gem/plugins'
make[3]: *…
[View More]** [all-recursive] Error 1
make[3]: Leaving directory `/home/pd/auto-build/pd-extended/externals/Gem'
make[2]: *** [/home/pd/auto-build/pd-extended/externals/Gem/Gem.pd_linux] Error 2
make[2]: Leaving directory `/home/pd/auto-build/pd-extended/externals'
make[1]: *** [externals_install] Error 2
make[1]: Leaving directory `/home/pd/auto-build/pd-extended/packages'
make: *** [install] Error 2
ls: cannot access /home/pd/auto-build/pd-extended/packages/linux_make/./Pd*.deb: No such file or directory
upload specs linux_make . deb
Uploading
Unexpected local arg: README
If arg is a remote file/dir, prefix it with a colon (:).
rsync error: syntax or usage error (code 1) at main.c(1246) [Receiver=3.0.9]
the full logfile - if it has been succesfully uploaded - can be viewed at:
http://autobuild.puredata.info/auto-build/2012-09-17/logs/2012-09-17_06.28.…
[View Less]
last 20 errors ----------------------------------------
rsync error: syntax or usage error (code 1) at main.c(1236) [Receiver=3.0.7]
last 15 lines ----------------------------------------
/home/pd/auto-build/pd-extended/packages/linux_make/build//usr/lib/pd-extended/extra/ekext
install: cannot stat `ninjacount-help.pd': No such file or directory
make[3]: *** [install-doc] Error 1
make[3]: Leaving directory `/home/pd/auto-build/pd-extended/externals/ekext'
make[2]: *** [ekext_install] Error 2
…
[View More]make[2]: Leaving directory `/home/pd/auto-build/pd-extended/externals'
make[1]: *** [externals_install] Error 2
make[1]: Leaving directory `/home/pd/auto-build/pd-extended/packages'
make: *** [install] Error 2
ls: cannot access /home/pd/auto-build/pd-extended/packages/linux_make/./Pd*.deb: No such file or directory
upload specs linux_make . deb
Uploading
Unexpected local arg: debian
If arg is a remote file/dir, prefix it with a colon (:).
rsync error: syntax or usage error (code 1) at main.c(1236) [Receiver=3.0.7]
the full logfile - if it has been succesfully uploaded - can be viewed at:
http://autobuild.puredata.info/auto-build/2012-09-17/logs/2012-09-17_06.25.…
[View Less]