Revision: 15931
http://pure-data.svn.sourceforge.net/pure-data/?rev=15931&view=rev
Author: jancsika1
Date: 2012-01-31 22:35:28 +0000 (Tue, 31 Jan 2012)
Log Message:
-----------
fixed a typo
Modified Paths:
--------------
trunk/doc/pddp/cpole~-help.pd
This was sent by the SourceForge.net collaborative development platform, the world's largest Open Source development site.
Revision: 15930
http://pure-data.svn.sourceforge.net/pure-data/?rev=15930&view=rev
Author: mrpeach
Date: 2012-01-31 22:21:16 +0000 (Tue, 31 Jan 2012)
Log Message:
-----------
Right-click opens .pdlua script in an editor. .pdluax still doesn't work unless script is in same directory Pd was started from.
Modified Paths:
--------------
trunk/externals/loaders/pdlua/src/pd.lua
trunk/externals/loaders/pdlua/src/pdlua.c
This was sent by the SourceForge.net collaborative …
[View More]development platform, the world's largest Open Source development site.
[View Less]
last 20 errors ----------------------------------------
checking for suffix of executables... configure: error: in `/home/pd/auto-build/pd-extended/pd':
configure: error: cannot compute suffix of executables: cannot compile and link
rsync error: syntax or usage error (code 1) at main.c(1246) [Receiver=3.0.9]
last 15 lines ----------------------------------------
checking for gcc... gcc
checking whether the C compiler works... yes
checking for C compiler default output file name... a.out
…
[View More]checking for suffix of executables... configure: error: in `/home/pd/auto-build/pd-extended/pd':
configure: error: cannot compute suffix of executables: cannot compile and link
See `config.log' for more details
make[1]: *** [pd] Error 1
make[1]: Leaving directory `/home/pd/auto-build/pd-extended/packages'
make: *** [install] Error 2
ls: cannot access /home/pd/auto-build/pd-extended/packages/linux_make/./Pd*.deb: No such file or directory
upload specs linux_make . deb
Uploading
Unexpected local arg: README
If arg is a remote file/dir, prefix it with a colon (:).
rsync error: syntax or usage error (code 1) at main.c(1246) [Receiver=3.0.9]
the full logfile - if it has been succesfully uploaded - can be viewed at:
http://autobuild.puredata.info/auto-build/2012-01-30/logs/2012-01-30_21.15.…
[View Less]
last 20 errors ----------------------------------------
rsync error: syntax or usage error (code 1) at main.c(1236) [Receiver=3.0.7]
last 15 lines ----------------------------------------
configure.ac:8: installing `m4/config/config.guess'
configure.ac:8: installing `m4/config/config.sub'
configure.ac:5: installing `m4/config/install-sh'
configure.ac:5: installing `m4/config/missing'
asio/Makefile.am: installing `m4/config/depcomp'
autoreconf: automake failed with exit status: 63
make[1]: *** […
[View More]pd] Error 63
make[1]: Leaving directory `/home/pd/auto-build/pd-extended/packages'
make: *** [install] Error 2
ls: cannot access /home/pd/auto-build/pd-extended/packages/linux_make/./Pd*.deb: No such file or directory
upload specs linux_make . deb
Uploading
Unexpected local arg: default.pdextended
If arg is a remote file/dir, prefix it with a colon (:).
rsync error: syntax or usage error (code 1) at main.c(1236) [Receiver=3.0.7]
the full logfile - if it has been succesfully uploaded - can be viewed at:
http://autobuild.puredata.info/auto-build/2012-01-31/logs/2012-01-31_02.08.…
[View Less]
last 20 errors ----------------------------------------
id: cannot find name for user ID 1001
id: cannot find name for user ID 1001
id: cannot find name for user ID 1001
id: cannot find name for user ID 1001
id: cannot find name for user ID 1001
id: cannot find name for user ID 1001
id: cannot find name for user ID 1001
id: cannot find name for user ID 1001
id: cannot find name for user ID 1001
id: cannot find name for user ID 1001
id: cannot find name for user ID 1001
id: cannot find name for …
[View More]user ID 1001
id: cannot find name for user ID 1001
id: cannot find name for user ID 1001
id: cannot find name for user ID 1001
id: cannot find name for user ID 1001
id: cannot find name for user ID 1001
id: cannot find name for user ID 1001
id: cannot find name for user ID 1001
rsync error: syntax or usage error (code 1) at main.c(1246) [Receiver=3.0.9]
last 15 lines ----------------------------------------
make[4]: *** [all] Error 2
make[4]: Leaving directory `/home/pd/auto-build/pd-extended/externals/Gem/src'
make[3]: *** [all-recursive] Error 1
make[3]: Leaving directory `/home/pd/auto-build/pd-extended/externals/Gem'
make[2]: *** [/home/pd/auto-build/pd-extended/externals/Gem/Gem.pd_linux] Error 2
make[2]: Leaving directory `/home/pd/auto-build/pd-extended/externals'
make[1]: *** [externals_install] Error 2
make[1]: Leaving directory `/home/pd/auto-build/pd-extended/packages'
make: *** [install] Error 2
ls: cannot access /home/pd/auto-build/pd-extended/packages/linux_make/./Pd*.deb: No such file or directory
upload specs linux_make . deb
Uploading
Unexpected local arg: README
If arg is a remote file/dir, prefix it with a colon (:).
rsync error: syntax or usage error (code 1) at main.c(1246) [Receiver=3.0.9]
the full logfile - if it has been succesfully uploaded - can be viewed at:
http://autobuild.puredata.info/auto-build/2012-01-30/logs/2012-01-30_21.15.…
[View Less]
last 20 errors ----------------------------------------
id: cannot find name for user ID 1001
id: cannot find name for user ID 1001
id: cannot find name for user ID 1001
id: cannot find name for user ID 1001
id: cannot find name for user ID 1001
id: cannot find name for user ID 1001
id: cannot find name for user ID 1001
id: cannot find name for user ID 1001
id: cannot find name for user ID 1001
id: cannot find name for user ID 1001
id: cannot find name for user ID 1001
id: cannot find name for …
[View More]user ID 1001
id: cannot find name for user ID 1001
id: cannot find name for user ID 1001
id: cannot find name for user ID 1001
id: cannot find name for user ID 1001
id: cannot find name for user ID 1001
id: cannot find name for user ID 1001
rsync error: errors selecting input/output files, dirs (code 3) at main.c(633) [Receiver=3.0.7]
rsync error: error in rsync protocol data stream (code 12) at io.c(601) [sender=3.0.8]
last 15 lines ----------------------------------------
/home/pd/auto-build/pd-extended/packages/linux_make/build//DEBIAN/control
sed -i 's!^\(Depends:.*\)!\1 , libasound2 (>> 1.0.24.1), libc6 (>= 2.3.6-6~), libc6 (>= 2.8), libfftw3-3, libflite1, libftgl2 (>= 2.1.3~rc5), libgcc1 (>= 1:4.1.1), libgl1-mesa-glx | libgl1, libglib2.0-0 (>= 2.24.0), libglu1-mesa | libglu1, libgsl0ldbl (>= 1.9), libjack-jackd2-0 (>= 1.9.5~dfsg-14) | libjack-0.116, liblua5.1-0, libmp3lame0, libogg0 (>= 1.0rc3), libpng12-0 (>= 1.2.13-4), libquicktime2 (>= 2:1.2.2), libsdl1.2debian (>= 1.2.10-1), libspeex1 (>= 1.2~beta3-1), libstdc++6 (>= 4.6), libvorbis0a (>= 1.1.2), libvorbisenc2 (>= 1.1.2), libvorbisfile3 (>= 1.1.2), libx11-6, libxv1, libxxf86vm1, tcl8.5 (>= 8.5.0), zlib1g (>= 1:1.1.4) , libasound2 (>> 1.0.24.1), libc6 (>= 2.3.6-6~), libc6 (>= 2.7), libgcc1 (>= 1:4.1.1), libjack-jackd2-0 (>= 1.9.5~dfsg-14) | libjack-0.116, libstdc++6 (>= 4.1.1)!' /home/pd/auto-build/pd-extended/packages/linux_make/build//DEBIAN/control
chmod -R go-w /home/pd/auto-build/pd-extended/packages/linux_make/build/
chmod -R a+r /home/pd/auto-build/pd-extended/packages/linux_make/build/
find /home/pd/auto-build/pd-extended/packages/linux_make/build/ -name \*.pd_linux | xargs chmod a-x
find /home/pd/auto-build/pd-extended/packages/linux_make/build/ -name \*.pd | xargs chmod a-x
find /home/pd/auto-build/pd-extended/packages/linux_make/build/ -type d | xargs chmod a+x
fakeroot dpkg-deb --build /home/pd/auto-build/pd-extended/packages/linux_make/build/ /home/pd/auto-build/pd-extended/packages/linux_make/Pd-0.43.1-extended-20120131.deb
dpkg-deb: building package `pd-extended' in `/home/pd/auto-build/pd-extended/packages/linux_make/Pd-0.43.1-extended-20120131.deb'.
upload specs linux_make . deb
Uploading /home/pd/auto-build/pd-extended/packages/linux_make/./Pd-0.43.1-extended-20120131.deb
rsync: change_dir#3 "/2012-01-31" (in upload) failed: No such file or directory (2)
rsync error: errors selecting input/output files, dirs (code 3) at main.c(633) [Receiver=3.0.7]
rsync: connection unexpectedly closed (5 bytes received so far) [sender]
rsync error: error in rsync protocol data stream (code 12) at io.c(601) [sender=3.0.8]
the full logfile - if it has been succesfully uploaded - can be viewed at:
http://autobuild.puredata.info/auto-build/2012-01-30/logs/2012-01-30_21.15.…
[View Less]
Revision: 15929
http://pure-data.svn.sourceforge.net/pure-data/?rev=15929&view=rev
Author: eighthave
Date: 2012-01-31 02:06:34 +0000 (Tue, 31 Jan 2012)
Log Message:
-----------
post version messages using verbose(0)
Modified Paths:
--------------
branches/pd-extended/0.43/externals/iem/iemguts/src/autoabstraction.c
branches/pd-extended/0.43/externals/iem/iemnet/iemnet.c
branches/pd-extended/0.43/externals/iem/mediasettings/audiosettings.c
branches/pd-…
[View More]extended/0.43/externals/iem/mediasettings/midisettings.c
This was sent by the SourceForge.net collaborative development platform, the world's largest Open Source development site.
[View Less]
This is an automated email from the git hooks/post-receive script. It was
generated because a ref change was pushed to the repository containing
the project "Pd-extended".
The branch, master has been updated
via 811b509c09c69296328c2a7fd7521b5efaf0f283 (commit)
via 8f5fa1cbea0357d70fd557c8dd59d770ee947b95 (commit)
via 8735ffa7f0df5722bd1444e338e32794a8e3f776 (commit)
via 6d735611aab81db52ead949f96e4c69dc2c1bca3 (commit)
via …
[View More]f30734df1f056913fa6556d809d2d9404c52f74d (commit)
via 3f762a5ff2015b649b0b3e3d9128d1ad573f31b4 (commit)
via b68400cddbeb2cea0f460de7555e9625c007789a (commit)
via eb166dac247c61e4e9d1e350e27d6b012985269d (commit)
via 189d1ac630f51935a977374ee18f18269a399a9b (commit)
via 62f631737ac86f691e1a19335636bc191502e95b (commit)
from 403331e2e8531e0e47f405a39957afc3c69772a4 (commit)
Those revisions listed above that are new to this repository have
not appeared on any other notification email; so we list those
revisions in full, below.
- Log -----------------------------------------------------------------
commit 811b509c09c69296328c2a7fd7521b5efaf0f283
Merge: 403331e 8f5fa1c
Author: Hans-Christoph Steiner <hans(a)eds.org>
Date: Mon Jan 30 20:54:44 2012 -0500
Merge branch 'patch_series'
-----------------------------------------------------------------------
Summary of changes:
doc/5.reference/about.pd | 161 +++++++++++++++++++++++-----------------
po/de.po | 30 ++++----
po/zh_tw.po | 15 ++--
src/Makefile.am | 2 +-
src/m_conf_pdextended.c | 1 +
src/makefile.mingw | 2 +-
src/{x_interface.c => print.c} | 33 ++------
tcl/pdwindow.tcl | 5 +-
8 files changed, 130 insertions(+), 119 deletions(-)
copy src/{x_interface.c => print.c} (68%)
hooks/post-receive
--
Pd-extended
[View Less]
This is an automated email from the git hooks/post-receive script. It was
generated because a ref change was pushed to the repository containing
the project "Pd-extended".
The branch, patch_series has been updated
via 8f5fa1cbea0357d70fd557c8dd59d770ee947b95 (commit)
via 8735ffa7f0df5722bd1444e338e32794a8e3f776 (commit)
via 6d735611aab81db52ead949f96e4c69dc2c1bca3 (commit)
via f30734df1f056913fa6556d809d2d9404c52f74d (commit)
via …
[View More]3f762a5ff2015b649b0b3e3d9128d1ad573f31b4 (commit)
via b68400cddbeb2cea0f460de7555e9625c007789a (commit)
via eb166dac247c61e4e9d1e350e27d6b012985269d (commit)
via 189d1ac630f51935a977374ee18f18269a399a9b (commit)
via 62f631737ac86f691e1a19335636bc191502e95b (commit)
from add1845f19af02d894ef6feb55860683ca630d44 (commit)
Those revisions listed above that are new to this repository have
not appeared on any other notification email; so we list those
revisions in full, below.
- Log -----------------------------------------------------------------
commit 8f5fa1cbea0357d70fd557c8dd59d770ee947b95
Author: Hans-Christoph Steiner <hans(a)eds.org>
Date: Mon Jan 30 20:35:15 2012 -0500
on start, wait for the event loop before printing the logbuffer to the Pd window
commit 8735ffa7f0df5722bd1444e338e32794a8e3f776
Author: Hans-Christoph Steiner <hans(a)eds.org>
Date: Mon Jan 30 20:00:49 2012 -0500
added more names to the about.pd credit list that should have already been there
commit 6d735611aab81db52ead949f96e4c69dc2c1bca3
Author: Hans-Christoph Steiner <hans(a)eds.org>
Date: Mon Jan 30 14:40:13 2012 -0500
randomize credit list in about.pd
commit f30734df1f056913fa6556d809d2d9404c52f74d
Author: Hans-Christoph Steiner <hans(a)eds.org>
Date: Mon Jan 30 14:25:49 2012 -0500
made corrections to the list of names for the credits
commit 3f762a5ff2015b649b0b3e3d9128d1ad573f31b4
Author: Hans-Christoph Steiner <hans(a)eds.org>
Date: Mon Jan 30 13:04:40 2012 -0500
updated name list in credits with new developers and translators
commit b68400cddbeb2cea0f460de7555e9625c007789a
Author: Hans-Christoph Steiner <hans(a)eds.org>
Date: Mon Jan 30 12:53:28 2012 -0500
converted pddp/print to msg box so the version is copy-n-pasteable
commit eb166dac247c61e4e9d1e350e27d6b012985269d
Author: Hans-Christoph Steiner <hans(a)eds.org>
Date: Mon Jan 30 12:35:49 2012 -0500
updated Traditional Chinese (zh_TW) translation
commit 189d1ac630f51935a977374ee18f18269a399a9b
Author: Hans-Christoph Steiner <hans(a)eds.org>
Date: Mon Jan 30 12:34:04 2012 -0500
updated German (de) translation
commit 62f631737ac86f691e1a19335636bc191502e95b
Author: Hans-Christoph Steiner <hans(a)eds.org>
Date: Mon Jan 30 12:32:12 2012 -0500
merged [print] from pd-extended/0.42 and pure-data 0.43.1 and made it built-in
-----------------------------------------------------------------------
Summary of changes:
doc/5.reference/about.pd | 161 +++++++++++++++++++++++-----------------
po/de.po | 30 ++++----
po/zh_tw.po | 15 ++--
src/Makefile.am | 2 +-
src/m_conf_pdextended.c | 1 +
src/makefile.mingw | 2 +-
src/{x_interface.c => print.c} | 33 ++------
tcl/pdwindow.tcl | 5 +-
8 files changed, 130 insertions(+), 119 deletions(-)
copy src/{x_interface.c => print.c} (68%)
hooks/post-receive
--
Pd-extended
[View Less]